Hello,
Devs.. I'm Compiling AOKP ( ANDROID OPEN KANG PROJECT ) For LG Optimus ME P350 But I'm Having Some Problems Getting it Compiled Please Guys Help me Fixing them ! Thanks
So Guys I synced AOKP ICS Source But I'm Getting Errors Building It !
So Guys My First Error Was in Dalvik !
I know all missing files for armv6
So I just Changed Dalvik folder with Cyanogen Mod Dalvik And My Dalvik was Fixed !
But Now I'm Getting Some WebRTC Error Please Help me Fixing it !
Here is my Build Log :
Code:
[email protected]:~/aokp/aokp$ . build/envsetup.sh && brunch p350
including device/lge/p350/vendorsetup.sh
including device/ti/panda/vendorsetup.sh
including vendor/aokp/vendorsetup.sh
including sdk/bash_completion/adb.bash
including vendor/aokp/vendorsetup.sh
============================================
PLATFORM_VERSION_CODENAME=REL
PLATFORM_VERSION=4.0.4
TARGET_PRODUCT=aokp_p350
TARGET_BUILD_VARIANT=userdebug
TARGET_BUILD_TYPE=release
TARGET_BUILD_APPS=
TARGET_ARCH=arm
TARGET_ARCH_VARIANT=armv6-vfp
HOST_ARCH=x86
HOST_OS=linux
HOST_BUILD_TYPE=release
BUILD_ID=IMM76I
============================================
============================================
PLATFORM_VERSION_CODENAME=REL
PLATFORM_VERSION=4.0.4
TARGET_PRODUCT=aokp_p350
TARGET_BUILD_VARIANT=userdebug
TARGET_BUILD_TYPE=release
TARGET_BUILD_APPS=
TARGET_ARCH=arm
TARGET_ARCH_VARIANT=armv6-vfp
HOST_ARCH=x86
HOST_OS=linux
HOST_BUILD_TYPE=release
BUILD_ID=IMM76I
============================================
build/core/Makefile:36: warning: overriding commands for target `out/target/product/p350/system/etc/wifi/wpa_supplicant.conf'
build/core/base_rules.mk:523: warning: ignoring old commands for target `out/target/product/p350/system/etc/wifi/wpa_supplicant.conf'
build/core/Makefile:36: warning: overriding commands for target `out/target/product/p350/system/app/Superuser.apk'
build/core/base_rules.mk:523: warning: ignoring old commands for target `out/target/product/p350/system/app/Superuser.apk'
No private recovery resources for TARGET_DEVICE p350
make -C kernel/lge/msm7x27 O=/home/keyur/aokp/aokp/out/target/product/p350/obj/KERNEL_OBJ ARCH=arm CROSS_COMPILE=" /home/keyur/aokp/aokp/prebuilt/linux-x86/toolchain/arm-eabi-4.4.3/bin/arm-eabi-" headers_install
make[1]: Entering directory `/home/keyur/aokp/aokp/kernel/lge/msm7x27'
target StaticExecutable: init (out/target/product/p350/obj/EXECUTABLES/init_intermediates/LINKED/init)
target Symbolic: adbd (out/target/product/p350/symbols/sbin/adbd)
target Symbolic: recovery (out/target/product/p350/symbols/system/bin/recovery)
target Symbolic: liblog (out/target/product/p350/symbols/system/lib/liblog.so)
target Symbolic: libstlport (out/target/product/p350/symbols/system/lib/libstlport.so)
target SharedLib: libicuuc (out/target/product/p350/obj/SHARED_LIBRARIES/libicuuc_intermediates/LINKED/libicuuc.so)
CHK include/linux/version.h
make[3]: `scripts/unifdef' is up to date.
Install: out/target/product/p350/system/lib/libgabi++.so
Copying: out/target/common/obj/JAVA_LIBRARIES/core-junit_intermediates/emma_out/lib/classes-jarjar.jar
Copying: out/target/common/obj/JAVA_LIBRARIES/ext_intermediates/emma_out/lib/classes-jarjar.jar
Copying: out/target/common/obj/JAVA_LIBRARIES/bouncycastle_intermediates/emma_out/lib/classes-jarjar.jar
Copying: out/target/common/obj/JAVA_LIBRARIES/guava_intermediates/classes.jar
make[1]: Leaving directory `/home/keyur/aokp/aokp/kernel/lge/msm7x27'
Copying: out/target/common/obj/JAVA_LIBRARIES/android-support-v4_intermediates/classes.jar
target Symbolic: libvorbisidec (out/target/product/p350/symbols/system/lib/libvorbisidec.so)
target Symbolic: libstagefright_amrnb_common (out/target/product/p350/symbols/system/lib/libstagefright_amrnb_common.so)
target Symbolic: libstagefright_enc_common (out/target/product/p350/symbols/system/lib/libstagefright_enc_common.so)
target Symbolic: libstagefright_avc_common (out/target/product/p350/symbols/system/lib/libstagefright_avc_common.so)
target Symbolic: libETC1 (out/target/product/p350/symbols/system/lib/libETC1.so)
target Symbolic: adb (out/target/product/p350/symbols/system/bin/adb)
target Symbolic: libglib (out/target/product/p350/symbols/system/lib/libglib.so)
target Symbolic: debuggerd (out/target/product/p350/symbols/system/bin/debuggerd)
target Symbolic: gzip (out/target/product/p350/symbols/system/bin/gzip)
target Symbolic: ip (out/target/product/p350/symbols/system/bin/ip)
target Symbolic: ip6tables (out/target/product/p350/symbols/system/bin/ip6tables)
target Symbolic: iptables (out/target/product/p350/symbols/system/bin/iptables)
target Symbolic: linker (out/target/product/p350/symbols/system/bin/linker)
target Symbolic: logwrapper (out/target/product/p350/symbols/system/bin/logwrapper)
target Symbolic: mkyaffs2image (out/target/product/p350/symbols/system/bin/mkyaffs2image)
target Symbolic: ping (out/target/product/p350/symbols/system/bin/ping)
target Symbolic: run-as (out/target/product/p350/symbols/system/bin/run-as)
target Symbolic: schedtest (out/target/product/p350/symbols/system/bin/schedtest)
target Symbolic: sdcard (out/target/product/p350/symbols/system/bin/sdcard)
target Symbolic: showlease (out/target/product/p350/symbols/system/bin/showlease)
target Symbolic: simg2img (out/target/product/p350/symbols/system/bin/simg2img)
target Symbolic: tc (out/target/product/p350/symbols/system/bin/tc)
Copying: out/target/common/obj/JAVA_LIBRARIES/apache-xml_intermediates/classes.jar
target Symbolic: libctest (out/target/product/p350/symbols/system/lib/libctest.so)
target Symbolic: libpagemap (out/target/product/p350/symbols/system/lib/libpagemap.so)
target Symbolic: libpng (out/target/product/p350/symbols/system/lib/libpng.so)
target Symbolic: libspeexresampler (out/target/product/p350/symbols/system/lib/libspeexresampler.so)
target Symbolic: libsurfaceflinger_client (out/target/product/p350/symbols/system/lib/libsurfaceflinger_client.so)
target thumb C++: libwebcore <= out/target/product/p350/obj/STATIC_LIBRARIES/libwebcore_intermediates/Source/WebCore/html/canvas/JSWebGLRenderingContext.cpp
target thumb C++: libwebcore <= out/target/product/p350/obj/STATIC_LIBRARIES/libwebcore_intermediates/Source/WebCore/html/canvas/JSWebGLTexture.cpp
out/target/product/p350/obj/STATIC_LIBRARIES/libwebcore_intermediates/Source/WebCore/html/canvas/JSWebGLRenderingContext.cpp:37:38: error: JSWebGLContextAttributes.h: No such file or directory
out/target/product/p350/obj/STATIC_LIBRARIES/libwebcore_intermediates/Source/WebCore/html/canvas/JSWebGLRenderingContext.cpp: In function 'JSC::EncodedJSValue WebCore::jsWebGLRenderingContextPrototypeFunctionGetContextAttributes(JSC::ExecState*)':
out/target/product/p350/obj/STATIC_LIBRARIES/libwebcore_intermediates/Source/WebCore/html/canvas/JSWebGLRenderingContext.cpp:2205: error: no matching function for call to 'toJS(JSC::ExecState*&, WebCore::JSDOMGlobalObject*, WebCore::WebGLContextAttributes*)'
out/target/product/p350/obj/STATIC_LIBRARIES/libwebcore_intermediates/Source/WebCore/html/canvas/JSCanvasRenderingContext.h:56: note: candidates are: JSC::JSValue WebCore::toJS(JSC::ExecState*, WebCore::JSDOMGlobalObject*, WebCore::CanvasRenderingContext*)
out/target/product/p350/obj/STATIC_LIBRARIES/libwebcore_intermediates/Source/WebCore/html/canvas/JSArrayBuffer.h:56: note: JSC::JSValue WebCore::toJS(JSC::ExecState*, WebCore::JSDOMGlobalObject*, WebCore::ArrayBuffer*)
out/target/product/p350/obj/STATIC_LIBRARIES/libwebcore_intermediates/Source/WebCore/html/canvas/JSArrayBufferView.h:55: note: JSC::JSValue WebCore::toJS(JSC::ExecState*, WebCore::JSDOMGlobalObject*, WebCore::ArrayBufferView*)
external/webkit/Source/WebCore/bindings/js/JSNodeCustom.h:77: note: JSC::JSValue WebCore::toJS(JSC::ExecState*, WebCore::JSDOMGlobalObject*, WebCore::Node*)
out/target/product/p350/obj/STATIC_LIBRARIES/libwebcore_intermediates/Source/WebCore/html/JSImageData.h:56: note: JSC::JSValue WebCore::toJS(JSC::ExecState*, WebCore::JSDOMGlobalObject*, WebCore::ImageData*)
out/target/product/p350/obj/STATIC_LIBRARIES/libwebcore_intermediates/Source/WebCore/html/canvas/JSWebGLActiveInfo.h:58: note: JSC::JSValue WebCore::toJS(JSC::ExecState*, WebCore::JSDOMGlobalObject*, WebCore::WebGLActiveInfo*)
out/target/product/p350/obj/STATIC_LIBRARIES/libwebcore_intermediates/Source/WebCore/html/canvas/JSWebGLBuffer.h:58: note: JSC::JSValue WebCore::toJS(JSC::ExecState*, WebCore::JSDOMGlobalObject*, WebCore::WebGLBuffer*)
out/target/product/p350/obj/STATIC_LIBRARIES/libwebcore_intermediates/Source/WebCore/html/canvas/JSWebGLFramebuffer.h:58: note: JSC::JSValue WebCore::toJS(JSC::ExecState*, WebCore::JSDOMGlobalObject*, WebCore::WebGLFramebuffer*)
out/target/product/p350/obj/STATIC_LIBRARIES/libwebcore_intermediates/Source/WebCore/html/canvas/JSWebGLProgram.h:58: note: JSC::JSValue WebCore::toJS(JSC::ExecState*, WebCore::JSDOMGlobalObject*, WebCore::WebGLProgram*)
out/target/product/p350/obj/STATIC_LIBRARIES/libwebcore_intermediates/Source/WebCore/html/canvas/JSWebGLRenderbuffer.h:58: note: JSC::JSValue WebCore::toJS(JSC::ExecState*, WebCore::JSDOMGlobalObject*, WebCore::WebGLRenderbuffer*)
out/target/product/p350/obj/STATIC_LIBRARIES/libwebcore_intermediates/Source/WebCore/html/canvas/JSWebGLShader.h:58: note: JSC::JSValue WebCore::toJS(JSC::ExecState*, WebCore::JSDOMGlobalObject*, WebCore::WebGLShader*)
out/target/product/p350/obj/STATIC_LIBRARIES/libwebcore_intermediates/Source/WebCore/html/canvas/JSWebGLTexture.h:58: note: JSC::JSValue WebCore::toJS(JSC::ExecState*, WebCore::JSDOMGlobalObject*, WebCore::WebGLTexture*)
out/target/product/p350/obj/STATIC_LIBRARIES/libwebcore_intermediates/Source/WebCore/html/canvas/JSWebGLUniformLocation.h:58: note: JSC::JSValue WebCore::toJS(JSC::ExecState*, WebCore::JSDOMGlobalObject*, WebCore::WebGLUniformLocation*)
target thumb C++: libwebcore <= out/target/product/p350/obj/STATIC_LIBRARIES/libwebcore_intermediates/Source/WebCore/html/canvas/JSWebGLUniformLocation.cpp
make: *** [out/target/product/p350/obj/STATIC_LIBRARIES/libwebcore_intermediates/Source/WebCore/html/canvas/JSWebGLRenderingContext.o] Error 1
make: *** Waiting for unfinished jobs....
[email protected]:~/aokp/aokp$
So Devs This is Log Please Help me Fixing this Error I Googled Much But Didn't go any help Please you Guys Help me I hope i'll Get Fix Soon As it is Forum of Best Devs Ever ! for Android !!
rom2maru said:
Hello,
Devs.. I'm Compiling AOKP ( ANDROID OPEN KANG PROJECT ) For LG Optimus ME P350 But I'm Having Some Problems Getting it Compiled Please Guys Help me Fixing them ! Thanks
So Guys I synced AOKP ICS Source But I'm Getting Errors Building It !
So Guys My First Error Was in Dalvik !
I know all missing files for armv6
So I just Changed Dalvik folder with Cyanogen Mod Dalvik And My Dalvik was Fixed !
But Now I'm Getting Some WebRTC Error Please Help me Fixing it !
Here is my Build Log :
Code:
[email protected]:~/aokp/aokp$ . build/envsetup.sh && brunch p350
including device/lge/p350/vendorsetup.sh
including device/ti/panda/vendorsetup.sh
including vendor/aokp/vendorsetup.sh
including sdk/bash_completion/adb.bash
including vendor/aokp/vendorsetup.sh
============================================
PLATFORM_VERSION_CODENAME=REL
PLATFORM_VERSION=4.0.4
TARGET_PRODUCT=aokp_p350
TARGET_BUILD_VARIANT=userdebug
TARGET_BUILD_TYPE=release
TARGET_BUILD_APPS=
TARGET_ARCH=arm
TARGET_ARCH_VARIANT=armv6-vfp
HOST_ARCH=x86
HOST_OS=linux
HOST_BUILD_TYPE=release
BUILD_ID=IMM76I
============================================
============================================
PLATFORM_VERSION_CODENAME=REL
PLATFORM_VERSION=4.0.4
TARGET_PRODUCT=aokp_p350
TARGET_BUILD_VARIANT=userdebug
TARGET_BUILD_TYPE=release
TARGET_BUILD_APPS=
TARGET_ARCH=arm
TARGET_ARCH_VARIANT=armv6-vfp
HOST_ARCH=x86
HOST_OS=linux
HOST_BUILD_TYPE=release
BUILD_ID=IMM76I
============================================
build/core/Makefile:36: warning: overriding commands for target `out/target/product/p350/system/etc/wifi/wpa_supplicant.conf'
build/core/base_rules.mk:523: warning: ignoring old commands for target `out/target/product/p350/system/etc/wifi/wpa_supplicant.conf'
build/core/Makefile:36: warning: overriding commands for target `out/target/product/p350/system/app/Superuser.apk'
build/core/base_rules.mk:523: warning: ignoring old commands for target `out/target/product/p350/system/app/Superuser.apk'
No private recovery resources for TARGET_DEVICE p350
make -C kernel/lge/msm7x27 O=/home/keyur/aokp/aokp/out/target/product/p350/obj/KERNEL_OBJ ARCH=arm CROSS_COMPILE=" /home/keyur/aokp/aokp/prebuilt/linux-x86/toolchain/arm-eabi-4.4.3/bin/arm-eabi-" headers_install
make[1]: Entering directory `/home/keyur/aokp/aokp/kernel/lge/msm7x27'
target StaticExecutable: init (out/target/product/p350/obj/EXECUTABLES/init_intermediates/LINKED/init)
target Symbolic: adbd (out/target/product/p350/symbols/sbin/adbd)
target Symbolic: recovery (out/target/product/p350/symbols/system/bin/recovery)
target Symbolic: liblog (out/target/product/p350/symbols/system/lib/liblog.so)
target Symbolic: libstlport (out/target/product/p350/symbols/system/lib/libstlport.so)
target SharedLib: libicuuc (out/target/product/p350/obj/SHARED_LIBRARIES/libicuuc_intermediates/LINKED/libicuuc.so)
CHK include/linux/version.h
make[3]: `scripts/unifdef' is up to date.
Install: out/target/product/p350/system/lib/libgabi++.so
Copying: out/target/common/obj/JAVA_LIBRARIES/core-junit_intermediates/emma_out/lib/classes-jarjar.jar
Copying: out/target/common/obj/JAVA_LIBRARIES/ext_intermediates/emma_out/lib/classes-jarjar.jar
Copying: out/target/common/obj/JAVA_LIBRARIES/bouncycastle_intermediates/emma_out/lib/classes-jarjar.jar
Copying: out/target/common/obj/JAVA_LIBRARIES/guava_intermediates/classes.jar
make[1]: Leaving directory `/home/keyur/aokp/aokp/kernel/lge/msm7x27'
Copying: out/target/common/obj/JAVA_LIBRARIES/android-support-v4_intermediates/classes.jar
target Symbolic: libvorbisidec (out/target/product/p350/symbols/system/lib/libvorbisidec.so)
target Symbolic: libstagefright_amrnb_common (out/target/product/p350/symbols/system/lib/libstagefright_amrnb_common.so)
target Symbolic: libstagefright_enc_common (out/target/product/p350/symbols/system/lib/libstagefright_enc_common.so)
target Symbolic: libstagefright_avc_common (out/target/product/p350/symbols/system/lib/libstagefright_avc_common.so)
target Symbolic: libETC1 (out/target/product/p350/symbols/system/lib/libETC1.so)
target Symbolic: adb (out/target/product/p350/symbols/system/bin/adb)
target Symbolic: libglib (out/target/product/p350/symbols/system/lib/libglib.so)
target Symbolic: debuggerd (out/target/product/p350/symbols/system/bin/debuggerd)
target Symbolic: gzip (out/target/product/p350/symbols/system/bin/gzip)
target Symbolic: ip (out/target/product/p350/symbols/system/bin/ip)
target Symbolic: ip6tables (out/target/product/p350/symbols/system/bin/ip6tables)
target Symbolic: iptables (out/target/product/p350/symbols/system/bin/iptables)
target Symbolic: linker (out/target/product/p350/symbols/system/bin/linker)
target Symbolic: logwrapper (out/target/product/p350/symbols/system/bin/logwrapper)
target Symbolic: mkyaffs2image (out/target/product/p350/symbols/system/bin/mkyaffs2image)
target Symbolic: ping (out/target/product/p350/symbols/system/bin/ping)
target Symbolic: run-as (out/target/product/p350/symbols/system/bin/run-as)
target Symbolic: schedtest (out/target/product/p350/symbols/system/bin/schedtest)
target Symbolic: sdcard (out/target/product/p350/symbols/system/bin/sdcard)
target Symbolic: showlease (out/target/product/p350/symbols/system/bin/showlease)
target Symbolic: simg2img (out/target/product/p350/symbols/system/bin/simg2img)
target Symbolic: tc (out/target/product/p350/symbols/system/bin/tc)
Copying: out/target/common/obj/JAVA_LIBRARIES/apache-xml_intermediates/classes.jar
target Symbolic: libctest (out/target/product/p350/symbols/system/lib/libctest.so)
target Symbolic: libpagemap (out/target/product/p350/symbols/system/lib/libpagemap.so)
target Symbolic: libpng (out/target/product/p350/symbols/system/lib/libpng.so)
target Symbolic: libspeexresampler (out/target/product/p350/symbols/system/lib/libspeexresampler.so)
target Symbolic: libsurfaceflinger_client (out/target/product/p350/symbols/system/lib/libsurfaceflinger_client.so)
target thumb C++: libwebcore <= out/target/product/p350/obj/STATIC_LIBRARIES/libwebcore_intermediates/Source/WebCore/html/canvas/JSWebGLRenderingContext.cpp
target thumb C++: libwebcore <= out/target/product/p350/obj/STATIC_LIBRARIES/libwebcore_intermediates/Source/WebCore/html/canvas/JSWebGLTexture.cpp
out/target/product/p350/obj/STATIC_LIBRARIES/libwebcore_intermediates/Source/WebCore/html/canvas/JSWebGLRenderingContext.cpp:37:38: error: JSWebGLContextAttributes.h: No such file or directory
out/target/product/p350/obj/STATIC_LIBRARIES/libwebcore_intermediates/Source/WebCore/html/canvas/JSWebGLRenderingContext.cpp: In function 'JSC::EncodedJSValue WebCore::jsWebGLRenderingContextPrototypeFunctionGetContextAttributes(JSC::ExecState*)':
out/target/product/p350/obj/STATIC_LIBRARIES/libwebcore_intermediates/Source/WebCore/html/canvas/JSWebGLRenderingContext.cpp:2205: error: no matching function for call to 'toJS(JSC::ExecState*&, WebCore::JSDOMGlobalObject*, WebCore::WebGLContextAttributes*)'
out/target/product/p350/obj/STATIC_LIBRARIES/libwebcore_intermediates/Source/WebCore/html/canvas/JSCanvasRenderingContext.h:56: note: candidates are: JSC::JSValue WebCore::toJS(JSC::ExecState*, WebCore::JSDOMGlobalObject*, WebCore::CanvasRenderingContext*)
out/target/product/p350/obj/STATIC_LIBRARIES/libwebcore_intermediates/Source/WebCore/html/canvas/JSArrayBuffer.h:56: note: JSC::JSValue WebCore::toJS(JSC::ExecState*, WebCore::JSDOMGlobalObject*, WebCore::ArrayBuffer*)
out/target/product/p350/obj/STATIC_LIBRARIES/libwebcore_intermediates/Source/WebCore/html/canvas/JSArrayBufferView.h:55: note: JSC::JSValue WebCore::toJS(JSC::ExecState*, WebCore::JSDOMGlobalObject*, WebCore::ArrayBufferView*)
external/webkit/Source/WebCore/bindings/js/JSNodeCustom.h:77: note: JSC::JSValue WebCore::toJS(JSC::ExecState*, WebCore::JSDOMGlobalObject*, WebCore::Node*)
out/target/product/p350/obj/STATIC_LIBRARIES/libwebcore_intermediates/Source/WebCore/html/JSImageData.h:56: note: JSC::JSValue WebCore::toJS(JSC::ExecState*, WebCore::JSDOMGlobalObject*, WebCore::ImageData*)
out/target/product/p350/obj/STATIC_LIBRARIES/libwebcore_intermediates/Source/WebCore/html/canvas/JSWebGLActiveInfo.h:58: note: JSC::JSValue WebCore::toJS(JSC::ExecState*, WebCore::JSDOMGlobalObject*, WebCore::WebGLActiveInfo*)
out/target/product/p350/obj/STATIC_LIBRARIES/libwebcore_intermediates/Source/WebCore/html/canvas/JSWebGLBuffer.h:58: note: JSC::JSValue WebCore::toJS(JSC::ExecState*, WebCore::JSDOMGlobalObject*, WebCore::WebGLBuffer*)
out/target/product/p350/obj/STATIC_LIBRARIES/libwebcore_intermediates/Source/WebCore/html/canvas/JSWebGLFramebuffer.h:58: note: JSC::JSValue WebCore::toJS(JSC::ExecState*, WebCore::JSDOMGlobalObject*, WebCore::WebGLFramebuffer*)
out/target/product/p350/obj/STATIC_LIBRARIES/libwebcore_intermediates/Source/WebCore/html/canvas/JSWebGLProgram.h:58: note: JSC::JSValue WebCore::toJS(JSC::ExecState*, WebCore::JSDOMGlobalObject*, WebCore::WebGLProgram*)
out/target/product/p350/obj/STATIC_LIBRARIES/libwebcore_intermediates/Source/WebCore/html/canvas/JSWebGLRenderbuffer.h:58: note: JSC::JSValue WebCore::toJS(JSC::ExecState*, WebCore::JSDOMGlobalObject*, WebCore::WebGLRenderbuffer*)
out/target/product/p350/obj/STATIC_LIBRARIES/libwebcore_intermediates/Source/WebCore/html/canvas/JSWebGLShader.h:58: note: JSC::JSValue WebCore::toJS(JSC::ExecState*, WebCore::JSDOMGlobalObject*, WebCore::WebGLShader*)
out/target/product/p350/obj/STATIC_LIBRARIES/libwebcore_intermediates/Source/WebCore/html/canvas/JSWebGLTexture.h:58: note: JSC::JSValue WebCore::toJS(JSC::ExecState*, WebCore::JSDOMGlobalObject*, WebCore::WebGLTexture*)
out/target/product/p350/obj/STATIC_LIBRARIES/libwebcore_intermediates/Source/WebCore/html/canvas/JSWebGLUniformLocation.h:58: note: JSC::JSValue WebCore::toJS(JSC::ExecState*, WebCore::JSDOMGlobalObject*, WebCore::WebGLUniformLocation*)
target thumb C++: libwebcore <= out/target/product/p350/obj/STATIC_LIBRARIES/libwebcore_intermediates/Source/WebCore/html/canvas/JSWebGLUniformLocation.cpp
make: *** [out/target/product/p350/obj/STATIC_LIBRARIES/libwebcore_intermediates/Source/WebCore/html/canvas/JSWebGLRenderingContext.o] Error 1
make: *** Waiting for unfinished jobs....
[email protected]:~/aokp/aokp$
So Devs This is Log Please Help me Fixing this Error I Googled Much But Didn't go any help Please you Guys Help me I hope i'll Get Fix Soon As it is Forum of Best Devs Ever ! for Android !!
Click to expand...
Click to collapse
It isn't LG Optimus ME forum !! -_- Go to Android Miscellaneous Developement or see over here!
Man I know but Miscellaneous Don't Get us Problem Fixed No one is Focusing Problems there Here maybe GT540 Can help me Fixing it As U Guys Also Have AOKP And GT540 is ARMv6 So The Developer for AOKP for GT540 Should Also Have Got this Problem So Maybe he can help me fixing it
rom2maru said:
Man I know but Miscellaneous Don't Get us Problem Fixed No one is Focusing Problems there Here maybe GT540 Can help me Fixing it As U Guys Also Have AOKP And GT540 is ARMv6 So The Developer for AOKP for GT540 Should Also Have Got this Problem So Maybe he can help me fixing it
Click to expand...
Click to collapse
well. i can't help but DevSwift and optimusDevLG are not here on XDA. DevSwift stopped developing for GT540 and optimusDevLG is from forum.android.com.pl but i don't know if he's still working on AOKP.. as always miroslav is our hope :silly:
Yeah Only Miroslav_MM is Hope !
Miroslav_mm Is online ! I hope we get fix soon
Dont be so mean... if the dev is willing to help then let this people stay... as if you would turn the needy away.
rom2maru said:
Man I know but Miscellaneous Don't Get us Problem Fixed No one is Focusing Problems there Here maybe GT540 Can help me Fixing it As U Guys Also Have AOKP And GT540 is ARMv6 So The Developer for AOKP for GT540 Should Also Have Got this Problem So Maybe he can help me fixing it
Click to expand...
Click to collapse
It hurts to read, please next time DonT Do This And Try To Add Comas.
And you can send a PM instead of doing a thread right?
DevSwift stopped developing cause his gt540 is broken and LgOptimusDev is inactive on android.pl forum..
You have 1 error
out/target/product/p350/obj/STATIC_LIBRARIES/libwebcore_intermediates/Source/WebCore/html/canvas/JSWebGLRenderingContext.cpp:37:38: error: JSWebGLContextAttributes.h: No such file or directory
so you missing JSWebGLContextAttributes.h. maybe need sync repo or find this missing file. maybe wrong include derectory.
for webrtc
https://github.com/Swift-Team/andro...mmit/6524d98d1f9352e638e56d294118d91d07c23276
Also missing file errors can be from lack of packages needed to build android. You should check if you have all the needed ones.
Please... if u need help, send a ****ing pm instead of making a new ****ing topic. This is NOT your device's forum. Thanks.
Sent from my GT540 using Tapatalk 2
Then report topic instead of swearing like an idiot.
~~
I think that if you want some help from specific user, maybe you have to try PM first (In this case, to Miroslav_mm), now, if you need help from somebody from our community it's good idea post a thread.
Just my oppinion, i don't say that it's wrong, but you're asking help from Miroslav_mm and nothing better that personal help. IMHO, and Good luck with that.
Miroslav doesn't reply to PM messages, so this is the only way to gain his attention.
shadovraven said:
Miroslav doesn't reply to PM messages, so this is the only way to gain his attention.
Click to expand...
Click to collapse
That's true
-Grift- said:
That's true
Click to expand...
Click to collapse
I dont have time to answer and my English is bad to answer on all questions! Every day few PM! I am just ignoring it! Sorry for that!
Its a trend for devs
Koloses said:
Also missing file errors can be from lack of packages needed to build android. You should check if you have all the needed ones.
Click to expand...
Click to collapse
broy fully configured !!! :banghead: and I'm already builded cm9
Sent from my LG-P500 using xda premium
OK So I decided to complie GB on Ubuntu, downloaded sources and all, but when I try to build an otapackage, I just get some files under my output folder! Anyone can help please? Here's my log:
[email protected]:~/WORKING_DIRECTORY# make otapackage
============================================
PLATFORM_VERSION_CODENAME=REL
PLATFORM_VERSION=2.3.7
TARGET_PRODUCT=cyanogen_shakira
TARGET_BUILD_VARIANT=eng
TARGET_SIMULATOR=false
TARGET_BUILD_TYPE=release
TARGET_BUILD_APPS=
TARGET_ARCH=arm
TARGET_ARCH_VARIANT=armv6-vfp
HOST_ARCH=x86
HOST_OS=linux
HOST_BUILD_TYPE=release
BUILD_ID=GINGERBREAD
============================================
find: `out/target/common/docs/gen': No such file or directory
find: `out/target/common/docs/gen': No such file or directory
find: `out/target/common/docs/gen': No such file or directory
find: `out/target/common/docs/gen': No such file or directory
find: `out/target/common/docs/gen': No such file or directory
build/core/Makefile:32: warning: overriding commands for target `out/target/product/shakira/system/bin/hciattach'
build/core/base_rules.mk:474: warning: ignoring old commands for target `out/target/product/shakira/system/bin/hciattach'
build/core/Makefile:32: warning: overriding commands for target `out/target/product/shakira/system/lib/libril.so'
build/core/base_rules.mk:474: warning: ignoring old commands for target `out/target/product/shakira/system/lib/libril.so'
build/core/Makefile:32: warning: overriding commands for target `out/target/product/shakira/system/lib/hw/gralloc.msm7k.so'
build/core/base_rules.mk:474: warning: ignoring old commands for target `out/target/product/shakira/system/lib/hw/gralloc.msm7k.so'
build/core/Makefile:32: warning: overriding commands for target `out/target/product/shakira/system/lib/hw/gralloc.default.so'
build/core/base_rules.mk:474: warning: ignoring old commands for target `out/target/product/shakira/system/lib/hw/gralloc.default.so'
build/core/Makefile:32: warning: overriding commands for target `out/target/product/shakira/system/lib/hw/copybit.msm7k.so'
build/core/base_rules.mk:474: warning: ignoring old commands for target `out/target/product/shakira/system/lib/hw/copybit.msm7k.so'
build/core/Makefile:32: warning: overriding commands for target `out/target/product/shakira/system/lib/libcamera.so'
build/core/base_rules.mk:474: warning: ignoring old commands for target `out/target/product/shakira/system/lib/libcamera.so'
build/core/Makefile:32: warning: overriding commands for target `out/target/product/shakira/system/lib/libaudio.so'
build/core/base_rules.mk:474: warning: ignoring old commands for target `out/target/product/shakira/system/lib/libaudio.so'
build/core/Makefile:32: warning: overriding commands for target `out/target/product/shakira/system/etc/wifi/softap/hostapd.conf'
build/core/base_rules.mk:474: warning: ignoring old commands for target `out/target/product/shakira/system/etc/wifi/softap/hostapd.conf'
build/core/Makefile:32: warning: overriding commands for target `out/target/product/shakira/system/etc/wifi/tiwlan.ini'
build/core/base_rules.mk:474: warning: ignoring old commands for target `out/target/product/shakira/system/etc/wifi/tiwlan.ini'
build/core/Makefile:32: warning: overriding commands for target `out/target/product/shakira/system/etc/wifi/softap/tiwlan_ap.ini'
build/core/base_rules.mk:474: warning: ignoring old commands for target `out/target/product/shakira/system/etc/wifi/softap/tiwlan_ap.ini'
build/core/Makefile:32: warning: overriding commands for target `out/target/product/shakira/kernel'
device/semc/shakira/AndroidBoard.mk:27: warning: ignoring old commands for target `out/target/product/shakira/kernel'
No private recovery resources for TARGET_DEVICE shakira
Install: out/host/linux-x86/bin/mkbootfs
target Prebuilt: (out/target/product/shakira/root/init.rc)
target Prebuilt: (out/target/product/shakira/root/ueventd.rc)
target Prebuilt: (out/target/product/shakira/root/init.goldfish.rc)
target Prebuilt: (out/target/product/shakira/root/ueventd.goldfish.rc)
Install: out/host/linux-x86/bin/apriori
Install: out/host/linux-x86/bin/soslim
target Non-prelinked: init (out/target/product/shakira/symbols/init)
Install: out/target/product/shakira/system/lib/libdl.so
Install: out/target/product/shakira/system/lib/libc.so
Install: out/target/product/shakira/system/lib/libstdc++.so
Install: out/target/product/shakira/system/lib/libm.so
Install: out/target/product/shakira/root/init
target Non-prelinked: adbd (out/target/product/shakira/symbols/sbin/adbd)
Install: out/target/product/shakira/root/sbin/adbd
Install: out/host/linux-x86/bin/minigzip
target Non-prelinked: recovery (out/target/product/shakira/symbols/system/bin/recovery)
Install: out/target/product/shakira/system/bin/recovery
target Prebuilt: e2fsck (out/target/product/shakira/obj/RECOVERY_EXECUTABLES/e2fsck_intermediates/e2fsck)
target Prebuilt: fix_permissions (out/target/product/shakira/obj/RECOVERY_EXECUTABLES/fix_permissions_intermediates/fix_permissions)
target Prebuilt: killrecovery.sh (out/target/product/shakira/obj/RECOVERY_EXECUTABLES/killrecovery.sh_intermediates/killrecovery.sh)
target Prebuilt: nandroid-md5.sh (out/target/product/shakira/obj/RECOVERY_EXECUTABLES/nandroid-md5.sh_intermediates/nandroid-md5.sh)
target Prebuilt: parted (out/target/product/shakira/obj/RECOVERY_EXECUTABLES/parted_intermediates/parted)
target Prebuilt: sdparted (out/target/product/shakira/obj/RECOVERY_EXECUTABLES/sdparted_intermediates/sdparted)
target Prebuilt: tune2fs (out/target/product/shakira/obj/RECOVERY_EXECUTABLES/tune2fs_intermediates/tune2fs)
make: Circular out/target/product/shakira/recovery/root.ts <- out/target/product/shakira/boot.img dependency dropped.
Install: out/host/linux-x86/framework/dumpkey.jar
target Non-prelinked: utility_flash_image (out/target/product/shakira/symbols/utilities/flash_image)
Install: out/target/product/shakira/utilities/flash_image
target Non-prelinked: static_busybox (out/target/product/shakira/symbols/utilities/busybox)
Install: out/target/product/shakira/utilities/busybox
target Non-prelinked: utility_erase_image (out/target/product/shakira/symbols/utilities/erase_image)
Install: out/target/product/shakira/utilities/erase_image
Install: out/host/linux-x86/bin/mkbootimg
Copy: out/target/product/shakira/kernel
target Prebuilt: (out/target/product/shakira/system/usr/share/zoneinfo/zoneinfo.dat)
target Prebuilt: (out/target/product/shakira/system/usr/share/zoneinfo/zoneinfo.idx)
target Prebuilt: (out/target/product/shakira/system/usr/share/zoneinfo/zoneinfo.version)
target Prebuilt: (out/target/product/shakira/system/bin/monkey)
target Prebuilt: system_etcdir (out/target/product/shakira/system/etc/bash/bash_logout)
target Prebuilt: system_etcdir (out/target/product/shakira/system/etc/bash/bashrc)
target Prebuilt: system_etcdir (out/target/product/shakira/system/etc/nano/asm.nanorc)
target Prebuilt: system_etcdir (out/target/product/shakira/system/etc/nano/awk.nanorc)
target Prebuilt: system_etcdir (out/target/product/shakira/system/etc/nano/cmake.nanorc)
target Prebuilt: system_etcdir (out/target/product/shakira/system/etc/nano/c.nanorc)
target Prebuilt: system_etcdir (out/target/product/shakira/system/etc/nano/css.nanorc)
target Prebuilt: system_etcdir (out/target/product/shakira/system/etc/nano/fortran.nanorc)
target Prebuilt: system_etcdir (out/target/product/shakira/system/etc/nano/groff.nanorc)
target Prebuilt: system_etcdir (out/target/product/shakira/system/etc/nano/html.nanorc)
target Prebuilt: system_etcdir (out/target/product/shakira/system/etc/nano/java.nanorc)
target Prebuilt: system_etcdir (out/target/product/shakira/system/etc/nano/makefile.nanorc)
target Prebuilt: system_etcdir (out/target/product/shakira/system/etc/nano/nanorc)
target Prebuilt: system_etcdir (out/target/product/shakira/system/etc/nano/nanorc.nanorc)
target Prebuilt: system_etcdir (out/target/product/shakira/system/etc/nano/objc.nanorc)
target Prebuilt: system_etcdir (out/target/product/shakira/system/etc/nano/ocaml.nanorc)
target Prebuilt: system_etcdir (out/target/product/shakira/system/etc/nano/patch.nanorc)
target Prebuilt: system_etcdir (out/target/product/shakira/system/etc/nano/perl.nanorc)
target Prebuilt: system_etcdir (out/target/product/shakira/system/etc/nano/php.nanorc)
target Prebuilt: system_etcdir (out/target/product/shakira/system/etc/nano/python.nanorc)
target Prebuilt: system_etcdir (out/target/product/shakira/system/etc/nano/ruby.nanorc)
target Prebuilt: system_etcdir (out/target/product/shakira/system/etc/nano/sh.nanorc)
target Prebuilt: system_etcdir (out/target/product/shakira/system/etc/nano/tcl.nanorc)
target Prebuilt: system_etcdir (out/target/product/shakira/system/etc/nano/tex.nanorc)
target Prebuilt: system_etcdir (out/target/product/shakira/system/etc/nano/xml.nanorc)
target Prebuilt: (out/target/product/shakira/system/usr/share/bmd/RFFspeed_501.bmd)
target Prebuilt: (out/target/product/shakira/system/usr/share/bmd/RFFstd_501.bmd)
target Prebuilt: (out/target/product/shakira/system/usr/srec/config/en.us/baseline11k.par)
target Prebuilt: (out/target/product/shakira/system/usr/srec/config/en.us/baseline8k.par)
target Prebuilt: (out/target/product/shakira/system/usr/srec/config/en.us/baseline.par)
target Prebuilt: (out/target/product/shakira/system/usr/srec/config/en.us/dictionary/basic.ok)
target Prebuilt: (out/target/product/shakira/system/usr/srec/config/en.us/dictionary/enroll.ok)
target Prebuilt: (out/target/product/shakira/system/usr/srec/config/en.us/dictionary/cmu6plus.ok.zip)
target Prebuilt: (out/target/product/shakira/system/usr/srec/config/en.us/g2p/en-US-ttp.data)
target Prebuilt: (out/target/product/shakira/system/usr/srec/config/en.us/models/generic.swiarb)
target Prebuilt: (out/target/product/shakira/system/usr/srec/config/en.us/models/generic11.lda)
target Prebuilt: (out/target/product/shakira/system/usr/srec/config/en.us/models/generic11_f.swimdl)
target Prebuilt: (out/target/product/shakira/system/usr/srec/config/en.us/models/generic11_m.swimdl)
target Prebuilt: (out/target/product/shakira/system/usr/srec/config/en.us/models/generic8.lda)
target Prebuilt: (out/target/product/shakira/system/usr/srec/config/en.us/models/generic8_f.swimdl)
target Prebuilt: (out/target/product/shakira/system/usr/srec/config/en.us/models/generic8_m.swimdl)
Install: out/host/linux-x86/lib/libESR_Portable.so
Install: out/host/linux-x86/lib/libESR_Shared.so
Install: out/host/linux-x86/lib/libSR_EventLog.so
Install: out/host/linux-x86/lib/libSR_Core.so
Install: out/host/linux-x86/lib/libSR_AcousticModels.so
Install: out/host/linux-x86/lib/libSR_AcousticState.so
Install: out/host/linux-x86/lib/libSR_G2P.so
Install: out/host/linux-x86/lib/libSR_Semproc.so
Install: out/host/linux-x86/lib/libSR_Vocabulary.so
Install: out/host/linux-x86/lib/libSR_Grammar.so
Install: out/host/linux-x86/lib/libSR_Nametag.so
Install: out/host/linux-x86/lib/libSR_Session.so
Install: out/host/linux-x86/lib/libfst.so
Install: out/host/linux-x86/bin/grxmlcompile
Install: out/host/linux-x86/lib/libSR_Recognizer.so
Install: out/host/linux-x86/bin/make_g2g
target Prebuilt: (out/target/product/shakira/system/bin/am)
target Prebuilt: (out/target/product/shakira/system/bin/bmgr)
target Prebuilt: (out/target/product/shakira/system/bin/ime)
target Prebuilt: (out/target/product/shakira/system/bin/input)
target Prebuilt: (out/target/product/shakira/system/bin/pm)
target Prebuilt: (out/target/product/shakira/system/bin/svc)
target Prebuilt: (out/target/product/shakira/system/etc/security/cacerts.bks)
target Prebuilt: (out/target/product/shakira/system/usr/keylayout/qwerty.kl)
target Prebuilt: (out/target/product/shakira/system/usr/keylayout/AVRCP.kl)
target Prebuilt: bluetooth_etcdir (out/target/product/shakira/system/etc/bluetooth/audio.conf)
target Prebuilt: bluetooth_etcdir (out/target/product/shakira/system/etc/bluetooth/input.conf)
target Prebuilt: bluetooth_etcdir (out/target/product/shakira/system/etc/bluetooth/main.conf)
target Prebuilt: bluetooth_etcdir (out/target/product/shakira/system/etc/bluetooth/blacklist.conf)
target Prebuilt: bluetooth_etcdir (out/target/product/shakira/system/etc/bluetooth/auto_pairing.conf)
target Prebuilt: system_etcdir (out/target/product/shakira/system/etc/dbus.conf)
target Prebuilt: system_etcdir (out/target/product/shakira/system/etc/hosts)
target Prebuilt: system_etcdir (out/target/product/shakira/system/etc/init.goldfish.sh)
Install: out/host/linux-x86/bin/aapt
Copying: out/target/common/obj/JAVA_LIBRARIES/core_intermediates/emma_out/lib/classes-jarjar.jar
Install: out/host/linux-x86/framework/dx.jar
Install: out/host/linux-x86/bin/dx
Copying: out/target/common/obj/JAVA_LIBRARIES/core-junit_intermediates/emma_out/lib/classes-jarjar.jar
Copying: out/target/common/obj/JAVA_LIBRARIES/ext_intermediates/emma_out/lib/classes-jarjar.jar
Install: out/host/linux-x86/bin/aidl
Copying: out/target/common/obj/JAVA_LIBRARIES/bouncycastle_intermediates/emma_out/lib/classes-jarjar.jar
Copying: out/target/common/obj/JAVA_LIBRARIES/framework_intermediates/emma_out/lib/classes-jarjar.jar
Copying: out/target/common/obj/APPS/ADWLauncher_intermediates/emma_out/lib/classes-jarjar.jar
Install: out/host/linux-x86/framework/signapk.jar
Install: out/host/linux-x86/bin/zipalign
Copy: out/host/linux-x86/usr/icu/icudt44l.dat
Copy: out/host/linux-x86/etc/security/cacerts.bks
Install: out/host/linux-x86/lib/libcrypto.so
Install: out/host/linux-x86/lib/libssl.so
Install: out/host/linux-x86/lib/libicuuc.so
Install: out/host/linux-x86/lib/libicui18n.so
Install: out/host/linux-x86/lib/libdvm.so
Install: out/host/linux-x86/bin/dexopt
Copying: out/target/common/obj/JAVA_LIBRARIES/android.policy_intermediates/emma_out/lib/classes-jarjar.jar
Copying: out/target/common/obj/JAVA_LIBRARIES/services_intermediates/emma_out/lib/classes-jarjar.jar
Install: out/target/product/shakira/system/app/ADWLauncher.odex
Install: out/target/product/shakira/system/app/ADWLauncher.apk
Copying: out/target/common/obj/APPS/AccountAndSyncSettings_intermediates/emma_out/lib/classes-jarjar.jar
Install: out/target/product/shakira/system/app/AccountAndSyncSettings.odex
Install: out/target/product/shakira/system/app/AccountAndSyncSettings.apk
Copying: out/target/common/obj/APPS/AndroidTerm_intermediates/emma_out/lib/classes-jarjar.jar
Install: out/target/product/shakira/system/app/AndroidTerm.odex
target Non-prelinked: libandroidterm2 (out/target/product/shakira/symbols/system/lib/libandroidterm2.so)
Install: out/target/product/shakira/system/lib/liblog.so
Install: out/target/product/shakira/system/lib/libz.so
Install: out/target/product/shakira/system/lib/libcutils.so
Install: out/target/product/shakira/system/lib/libutils.so
Install: out/target/product/shakira/system/lib/libandroidterm2.so
Install: out/target/product/shakira/system/app/AndroidTerm.apk
Install: out/target/product/shakira/system/app/Androidian.apk
Copying: out/target/common/obj/APPS/ApplicationsProvider_intermediates/emma_out/lib/classes-jarjar.jar
Install: out/target/product/shakira/system/app/ApplicationsProvider.odex
Install: out/target/product/shakira/system/app/ApplicationsProvider.apk
Copying: out/target/common/obj/JAVA_LIBRARIES/javax.obex_intermediates/emma_out/lib/classes-jarjar.jar
Copying: out/target/common/obj/APPS/Bluetooth_intermediates/emma_out/lib/classes-jarjar.jar
Install: out/target/product/shakira/system/app/Bluetooth.odex
Install: out/target/product/shakira/system/app/Bluetooth.apk
Copying: out/target/common/obj/JAVA_LIBRARIES/android-common_intermediates/emma_out/lib/classes-jarjar.jar
target Static Jar: android-common (out/target/common/obj/JAVA_LIBRARIES/android-common_intermediates/javalib.jar)
Copying: out/target/common/obj/APPS/Browser_intermediates/emma_out/lib/classes-jarjar.jar
Install: out/target/product/shakira/system/app/Browser.odex
Install: out/target/product/shakira/system/app/Browser.apk
Copying: out/target/common/obj/APPS/CMParts_intermediates/emma_out/lib/classes-jarjar.jar
Install: out/target/product/shakira/system/app/CMParts.odex
Install: out/target/product/shakira/system/app/CMParts.apk
Copying: out/target/common/obj/APPS/CMScreenshot_intermediates/emma_out/lib/classes-jarjar.jar
Install: out/target/product/shakira/system/app/CMScreenshot.odex
Install: out/target/product/shakira/system/app/CMScreenshot.apk
make: *** No rule to make target `out/target/common/obj/JAVA_LIBRARIES/libGoogleAnalyticsV2_intermediates/javalib.jar', needed by `out/target/common/obj/APPS/CMStats_intermediates/classes-full-debug.jar'. Stop.
[email protected]:~/WORKING_DIRECTORY#
I don't know what's the problem but try 'make bacon' instead of 'make otapackage' ?
Sent from my Nexus 7 using xda app-developers app
Hi there,
It's my first time to try to build LineageOS from source for Mi 5 (gemini), and I am following official instructions here wiki lineageos org gemini_build html
But I got errors after runing 'brunch gemini'. Any help are welcome, thanks very much!
Code:
PLATFORM_VERSION_CODENAME=REL
PLATFORM_VERSION=7.1.1
LINEAGE_VERSION=14.1-20170130-UNOFFICIAL-gemini
TARGET_PRODUCT=lineage_gemini
TARGET_BUILD_VARIANT=userdebug
TARGET_BUILD_TYPE=release
TARGET_BUILD_APPS=
TARGET_ARCH=arm64
TARGET_ARCH_VARIANT=armv8-a
TARGET_CPU_VARIANT=kryo
TARGET_2ND_ARCH=arm
TARGET_2ND_ARCH_VARIANT=armv7-a-neon
TARGET_2ND_CPU_VARIANT=cortex-a53
HOST_ARCH=x86_64
HOST_2ND_ARCH=x86
HOST_OS=linux
HOST_OS_EXTRA=Linux-4.4.0-31-generic-x86_64-with-Ubuntu-16.04-xenial
HOST_CROSS_OS=windows
HOST_CROSS_ARCH=x86
HOST_CROSS_2ND_ARCH=x86_64
HOST_BUILD_TYPE=release
BUILD_ID=NMF26V
OUT_DIR=/root/android/system/out
============================================
build/core/binary.mk:1253: external/deqp/Android.mk: libdeqp: Unused source files: \
build/core/binary.mk:1253: external/deqp/Android.mk: libdeqp: Unused source files: \
build/core/binary.mk:1253: external/pdfium/third_party/pdfiumbigint.mk: libpdfiumbigint: Unused source files: bigint/BigInteger.cc bigint/BigIntegerUtils.cc bigint/BigUnsigned.cc bigint/BigUnsignedInABase.cc
build/core/binary.mk:1253: external/pdfium/third_party/pdfiumbigint.mk: libpdfiumbigint: Unused source files: bigint/BigInteger.cc bigint/BigIntegerUtils.cc bigint/BigUnsigned.cc bigint/BigUnsignedInABase.cc
./external/speex/Android.mk:56: TODOArm64: enable neon in libspeex
build/core/package_internal.mk:143: Empty argument supplied to find-subdir-assets
find: ‘/root/android/system/out/target/common/obj/SHARED_LIBRARIES/libwifi-hal-mock_intermediates’: No such file or directory
build/core/package_internal.mk:143: Empty argument supplied to find-subdir-assets
No private recovery resources for TARGET_DEVICE gemini
build/core/java.mk:334: warning: overriding commands for target `/root/android/system/out/target/common/obj/APPS/Dialer_intermediates/src/src/org/codeaurora/presenceserv/IPresenceService.java'
build/core/java.mk:334: warning: ignoring old commands for target `/root/android/system/out/target/common/obj/APPS/Dialer_intermediates/src/src/org/codeaurora/presenceserv/IPresenceService.java'
build/core/java.mk:334: warning: overriding commands for target `/root/android/system/out/target/common/obj/APPS/Dialer_intermediates/src/src/org/codeaurora/presenceserv/IPresenceServiceCB.java'
build/core/java.mk:334: warning: ignoring old commands for target `/root/android/system/out/target/common/obj/APPS/Dialer_intermediates/src/src/org/codeaurora/presenceserv/IPresenceServiceCB.java'
build/core/base_rules.mk:316: warning: overriding commands for target `/root/android/system/out/target/product/gemini/root/res/images/charger/battery_fail.png'
build/core/base_rules.mk:316: warning: ignoring old commands for target `/root/android/system/out/target/product/gemini/root/res/images/charger/battery_fail.png'
build/core/Makefile:34: warning: overriding commands for target `/root/android/system/out/target/product/gemini/system/etc/libnfc-brcm.conf'
build/core/base_rules.mk:316: warning: ignoring old commands for target `/root/android/system/out/target/product/gemini/system/etc/libnfc-brcm.conf'
build/core/Makefile:34: warning: overriding commands for target `/root/android/system/out/target/product/gemini/system/etc/libnfc-nxp.conf'
build/core/base_rules.mk:316: warning: ignoring old commands for target `/root/android/system/out/target/product/gemini/system/etc/libnfc-nxp.conf'
Starting build with ninja
ninja: Entering directory `.'
ninja: error: '/root/android/system/out/target/product/gemini/obj/SHARED_LIBRARIES/libqminvapi_intermediates/export_includes', needed by '/root/android/system/out/target/product/gemini/obj/EXECUTABLES/readmac_intermediates/import_includes', missing and no known rule to make it
build/core/ninja.mk:151: recipe for target 'ninja_wrapper' failed
make: *** [ninja_wrapper] Error 1
make: Leaving directory '/root/android/system'
#### make failed to build some targets (45 seconds) ####
I try to build the LineageOS,but the system fails to compile
how to fix it?
Reference documentation
http://wiki.lineageos.org/gemini_build.html#start-the-build
build/core/base_rules.mk:316: warning: overriding commands for target `/mnt/media/system/out/target/product/gemini/root/res/images/charger/battery_fail.png'
build/core/base_rules.mk:316: warning: ignoring old commands for target `/mnt/media/system/out/target/product/gemini/root/res/images/charger/battery_fail.png'
build/core/Makefile:34: warning: overriding commands for target `/mnt/media/system/out/target/product/gemini/system/etc/libnfc-brcm.conf'
build/core/base_rules.mk:316: warning: ignoring old commands for target `/mnt/media/system/out/target/product/gemini/system/etc/libnfc-brcm.conf'
build/core/Makefile:34: warning: overriding commands for target `/mnt/media/system/out/target/product/gemini/system/etc/libnfc-nxp.conf'
build/core/base_rules.mk:316: warning: ignoring old commands for target `/mnt/media/system/out/target/product/gemini/system/etc/libnfc-nxp.conf'
Starting build with ninja
ninja: Entering directory `.'
ninja: error: '/mnt/media/system/out/target/product/gemini/obj/SHARED_LIBRARIES/libqminvapi_intermediates/export_includes', needed by '/mnt/media/system/out/target/product/gemini/obj/EXECUTABLES/readmac_intermediates/import_includes', missing and no known rule to make it
build/core/ninja.mk:151: recipe for target 'ninja_wrapper' failed
make: *** [ninja_wrapper] Error 1
make: Leaving directory '/mnt/media/system'
if i run <code> mmm wifi </code>
Running kati to generate build-lineage_gemini-mmm-device_xiaomi_gemini_wifi_Android.mk.ninja...
No need to regenerate ninja file
Starting build with ninja
ninja: Entering directory `.'
ninja: error: '/mnt/media/system/out/target/product/gemini/obj/SHARED_LIBRARIES/libutils_intermediates/export_includes', needed by '/mnt/media/system/out/target/product/gemini/obj/EXECUTABLES/readmac_intermediates/import_includes', missing and no known rule to make it
build/core/ninja.mk:151: recipe for target 'ninja_wrapper' failed
make: *** [ninja_wrapper] Error 1
make: Leaving directory '/mnt/media/system'
Hello
I am trying to build an image for Pixel 5a, on the last part, when I run the following:
Code:
$ brunch barbet
on the last part, I am getting an error as follows:
Code:
============================================
$(shell date -u +%Y%m%d) was changed, regenerating...
$(shell date -u +%Y%m%d) was changed, regenerating...
[ 94% 599/632] including system/sepolicy/Android.mk ...
system/sepolicy/Android.mk:57: warning: BOARD_PLAT_PUBLIC_SEPOLICY_DIR has been deprecated. Use SYSTEM_EXT_PUBLIC_SEPOLICY_DIRS instead.
system/sepolicy/Android.mk:62: warning: BOARD_PLAT_PRIVATE_SEPOLICY_DIR has been deprecated. Use SYSTEM_EXT_PRIVATE_SEPOLICY_DIRS instead.
[100% 632/632] writing build rules ...
build/make/core/Makefile:61: warning: overriding commands for target `out/target/product/barbet/product/media/bootanimation.zip'
build/make/core/base_rules.mk:525: warning: ignoring old commands for target `out/target/product/barbet/product/media/bootanimation.zip'
build/make/core/Makefile:61: warning: overriding commands for target `out/target/product/barbet/vendor/etc/gps.conf'
build/make/core/base_rules.mk:525: warning: ignoring old commands for target `out/target/product/barbet/vendor/etc/gps.conf'
build/make/core/Makefile:61: warning: overriding commands for target `out/target/product/barbet/product/etc/res/images/charger/battery_fail.png'
build/make/core/base_rules.mk:525: warning: ignoring old commands for target `out/target/product/barbet/product/etc/res/images/charger/battery_fail.png'
build/make/core/Makefile:61: warning: overriding commands for target `out/target/product/barbet/product/etc/res/images/charger/battery_scale.png'
build/make/core/base_rules.mk:525: warning: ignoring old commands for target `out/target/product/barbet/product/etc/res/images/charger/battery_scale.png'
build/make/core/Makefile:61: warning: overriding commands for target `out/target/product/barbet/product/etc/res/values/charger/animation.txt'
build/make/core/base_rules.mk:525: warning: ignoring old commands for target `out/target/product/barbet/product/etc/res/values/charger/animation.txt'
build/make/core/Makefile:61: warning: overriding commands for target `out/target/product/barbet/vendor/lib/ese_spi_st.so'
build/make/core/base_rules.mk:525: warning: ignoring old commands for target `out/target/product/barbet/vendor/lib/ese_spi_st.so'
FAILED: ninja: 'system/core/libhelios/libhelios.so', needed by 'out/target/product/barbet/system/lib64/libhelios.so', missing and no known rule to make it
00:36:56 ninja failed with: exit status 1
#### failed to build some targets (01:25 (mm:ss)) ####
is there anyone that know where to find 'libhelios.so', please.
I am so excited to install my own image to the phone.
Thank you very much
Rasim